{"text_format":"1","workbook":"xlsx","n_sheets":16,"sheets":["Qingdao（RORO船）","Shanghai","Keelung","Qingdao","HAIPHONG","HOCHIMINH","Hongkong","PUSAN(PANSTAR)","PUSAN(信永)","Bangkok","Singapore","祝日 (2)","CALL SIGN","祝日","Sheet1","Sheet2"],"not_rendered":{"charts":0,"images":2,"macros":1,"external_links":0,"defined_names":11,"comments":0,"pivot_tables":0},"unopened":[],"bounds":{"document_bytes":16777216,"sheet_cells":100000,"rows_first":2000,"rows_last":500,"rows_between":2000,"halvings":0,"cell_chars":16384,"cell_head_chars":4096},"cells_cut":0,"cells_raw":0,"read":"whole","date_system":"1900"}

{"sheet":"Qingdao（RORO船）","index":0,"n_rows":40,"n_cols":10,"rows_kept":40,"cut":false,"hidden":true,"merged":[[15,1,15,2],[2,1,2,9],[4,1,4,9],[5,5,5,8],[8,1,9,2],[8,3,9,3],[8,4,9,4],[9,6,9,8],[10,1,10,2],[11,1,11,2],[12,1,12,2],[13,1,13,2],[14,1,14,2],[37,1,37,4],[38,1,38,9],[39,0,39,9],[16,1,16,2],[28,0,28,9],[30,0,30,9],[31,0,31,9],[34,1,34,3],[34,6,34,8]]}
[]
[]
[]
[]
[]
[null,null,null,null,null,{"$f":"Shanghai!$I$5","v":"2025-04-30"},null,null,null,"更新"]
[null,"※国内消防法該当貨物は取扱不可となります。"]
[]
[null,"VESSEL",null,"VOY","CALL","CFS CUT","ETA",null,"ETD","ETA"]
[null,null,null,null,null,"OSAKA/KOBE","KOBE",null,null,"QINGDAO"]
[null,"DCL QINGDAO",null,"2307W",{"$error":"#N/A"},{"$f":"WORKDAY(I11,-2,'祝日 (2)'!B139:B155)","v":"2023-02-17"},"2023-02-21","-",{"$f":"+G11","v":"2023-02-21"},{"$f":"I11+3","v":"2023-02-24"}]
[null,"DCL QINGDAO",null,"2308W",{"$error":"#N/A"},{"$f":"WORKDAY(I12,-2,'祝日 (2)'!B139:B155)","v":"2023-02-24"},"2023-02-28","-","2023-02-28","2023-03-03"]
[null,"DCL QINGDAO",null,"2309W",{"$error":"#N/A"},{"$f":"WORKDAY(I13,-2,'祝日 (2)'!B139:B155)","v":"2023-03-03"},"2023-03-07","-","2023-03-07","2023-03-10"]
[null,"DCL QINGDAO",null,"2310W",{"$error":"#N/A"},{"$f":"WORKDAY(I14,-2,'祝日 (2)'!B139:B155)","v":"2023-03-10"},"2023-03-14","-","2023-03-14","2023-03-17"]
[null,"DCL QINGDAO",null,"030W",{"$error":"#N/A"},{"$error":"#REF!"},"2022-11-29","-","2022-11-29","2022-12-02"]
[null,"DCL QINGDAO",null,"031W",{"$error":"#N/A"},{"$error":"#REF!"},"2022-12-06","-","2022-12-06","2022-12-09"]
[null,"DCL QINGDAO",null,"032W",{"$error":"#N/A"},{"$error":"#REF!"},"2022-12-13","-","2022-12-13","2022-12-16"]
[]
[]
[]
{"$rows_left_out":21}
{"sheet":"Shanghai","index":1,"n_rows":37,"n_cols":13,"rows_kept":37,"cut":false,"hidden":false,"merged":[[29,12,29,13],[27,12,27,13],[28,12,28,13],[6,5,7,5],[5,6,5,10],[6,8,6,9],[5,12,5,13],[6,12,6,13],[6,6,6,7],[16,7,16,10],[8,8,8,10],[36,1,36,10],[23,1,23,10],[22,3,22,9],[35,2,35,10],[31,2,31,6],[1,12,1,13],[2,12,2,13],[3,12,3,13],[4,12,4,13],[1,2,1,8],[3,2,3,8],[4,8,4,9],[8,2,8,3],[8,14,8,15],[6,2,7,3],[6,4,7,4],[7,12,7,13],[9,2,9,3],[9,14,9,15],[10,2,10,3],[10,14,10,15],[11,2,11,3],[11,14,11,15],[15,2,15,3],[15,14,15,15],[12,2,12,3],[12,14,12,15],[13,2,13,3],[13,14,13,15],[14,2,14,3],[14,14,14,15]]}
[]
[null,null,null,null,null,null,null,null,null,null,null,null,"CHUN JIN"]
[null,null,null,null,null,null,null,null,null,null,null,null,"MILD TEMPO"]
[null,null,null,null,null,null,null,null,null,null,null,null,"MLD WALTZ"]
[null,null,null,null,null,null,null,null,"2025-04-30",null,"更新",null,"GLORY SHENGDON"]
[null,null,null,null,null,null,"上海着岸バース・・・上海明東コンテナターミナル (SMCT 外高橋 5・6期)",null,null,null,null,null,"JJ NAGOYA"]
[null,null,"VESSEL",null,"VOY","CALL","OSAKA",null,"KOBE",null,"SHANGHAI",null,"GLORY GUANGZHOU"]
[null,null,null,null,null,null,"CUT","ETD","CUT","ETD","ETA",null,"CONTRIVIA"]
[null,null,"MILD TEMPO",null,"2518W",{"$f":"VLOOKUP(C9,'CALL SIGN'!C:D,2,FALSE)","v":"VROE5"},null,null,"SKIP"]
[null,null,"CHUN JIN",null,"2519W",null,"2025-05-07",{"$f":"G10+2","v":"2025-05-09"},{"$f":"G10","v":"2025-05-07"},{"$f":"I10+2","v":"2025-05-09"},{"$f":"J10+2","v":"2025-05-11"},null,"①日付変える"]
[null,null,"MILD TEMPO",null,"2519W",{"$f":"VLOOKUP(C11,'CALL SIGN'!C:D,2,FALSE)","v":"VROE5"},null,null,"2025-05-09",{"$f":"I11+4","v":"2025-05-13"},{"$f":"J11+2","v":"2025-05-15"}]
[null,null,"CHUN JIN",null,"2520W",null,"2025-05-14",{"$f":"G12+2","v":"2025-05-16"},{"$f":"G12","v":"2025-05-14"},{"$f":"I12+2","v":"2025-05-16"},"2025-05-18",null,"①日付変える"]
[null,null,"MILD TEMPO",null,"2520W",{"$f":"VLOOKUP(C13,'CALL SIGN'!C:D,2,FALSE)","v":"VROE5"},null,null,"2025-05-16",{"$f":"I13+4","v":"2025-05-20"},"2025-05-22"]
[null,null,"RESURGENCE",null,"2521W",null,"2025-05-21",{"$f":"G14+2","v":"2025-05-23"},{"$f":"G14","v":"2025-05-21"},{"$f":"H14","v":"2025-05-23"},"2025-05-25",null,"①日付変える"]
[null,null,"GLORY SHANGHAI",null,"2521W",{"$f":"VLOOKUP(C15,'CALL SIGN'!C:D,2,FALSE)","v":"VROS4"},null,null,"2025-05-23",{"$f":"I15+4","v":"2025-05-27"},"2025-05-29"]
[null,null,"QIU JIN",null,"2522W",null,"2025-05-28",{"$f":"G16+2","v":"2025-05-30"},{"$f":"G16","v":"2025-05-28"},{"$f":"H16","v":"2025-05-30"},"2025-06-01",null,"①日付変える"]
[null,null,"*本船名変更"]
[]
[]
[]
{"$rows_left_out":18}
{"sheet":"Keelung","index":2,"n_rows":39,"n_cols":13,"rows_kept":39,"cut":false,"hidden":false,"merged":[[14,1,14,2],[15,1,15,2],[16,1,16,2],[10,5,10,9],[9,1,9,2],[10,1,10,2],[11,1,11,2],[12,1,12,2],[13,1,13,2],[2,1,2,7],[4,1,4,7],[5,7,5,8],[7,1,8,2],[7,3,8,3],[7,7,7,8],[7,4,8,4],[7,5,7,6],[29,10,29,12],[28,0,28,9],[43,6,44,6],[43,9,44,9],[37,1,37,9],[38,0,38,9],[32,1,32,3],[32,5,32,6],[35,1,35,3],[43,8,44,8],[34,1,34,3],[32,7,32,8],[43,7,44,7],[33,1,33,3],[43,5,44,5],[29,0,29,9]]}
[]
[]
[]
[]
[]
[null,null,null,null,null,null,null,{"$f":"+Shanghai!I5","v":"2025-04-30"},null,"更新"]
[]
[null,"VESSEL",null,"VOY","CALL","OSAKA",null,"KOBE",null,"KEELUNG"]
[null,null,null,null,null,"CUT","ETD","CUT","ETD","ETA"]
["*","AS ANNE",null,"005S",{"$f":"VLOOKUP(B10,#REF!,2,FALSE)","v":{"$error":"#REF!"}},"2025-05-01",{"$f":"F10+3","v":"2025-05-04"},{"$f":"F10","v":"2025-05-01"},{"$f":"G10","v":"2025-05-04"},{"$f":"I10+3","v":"2025-05-07"},null,"*","B/L表記： Port of Discharge: TAIPEI,TAIWAN, Place of Delivery: KEELUNG CFS"]
[null,null,null,null,{"$f":"VLOOKUP(B11,#REF!,2,FALSE)","v":{"$error":"#REF!"}},"NO SERVICE",null,null,null,null,null,"#","本船変更"]
[null,"YM INCEPTION",null,"232S",{"$f":"VLOOKUP(B12,#REF!,2,FALSE)","v":{"$error":"#REF!"}},"2025-05-08",{"$f":"F12+3","v":"2025-05-11"},{"$f":"F12","v":"2025-05-08"},{"$f":"G12","v":"2025-05-11"},{"$f":"I12+3","v":"2025-05-14"},null,"*","B/L表記： Port of Discharge: TAIPEI,TAIWAN, Place of Delivery: KEELUNG CFS"]
[null,"TS JOHOR",null,"25012S",{"$f":"VLOOKUP(B13,#REF!,2,FALSE)","v":{"$error":"#REF!"}},"2025-05-13","2025-05-16",{"$f":"F13+1","v":"2025-05-14"},"2025-05-16",{"$f":"I13+4","v":"2025-05-20"},null,"#","本船変更"]
[null,"YM IMMENSE",null,"392S",{"$f":"VLOOKUP(B14,#REF!,2,FALSE)","v":{"$error":"#REF!"}},"2025-05-15",{"$f":"F14+3","v":"2025-05-18"},{"$f":"F14","v":"2025-05-15"},{"$f":"G14","v":"2025-05-18"},{"$f":"I14+3","v":"2025-05-21"},null,"*","B/L表記： Port of Discharge: TAIPEI,TAIWAN, Place of Delivery: KEELUNG CFS"]
[null,"TS SHENZHEN",null,"25011S",{"$f":"VLOOKUP(B15,#REF!,2,FALSE)","v":{"$error":"#REF!"}},"2025-05-20",{"$f":"F15+3","v":"2025-05-23"},{"$f":"F15+1","v":"2025-05-21"},{"$f":"G15","v":"2025-05-23"},{"$f":"I15+4","v":"2025-05-27"},null,"#","本船変更"]
[null,"HORAI BRIDGE",null,"211S",{"$f":"VLOOKUP(B16,#REF!,2,FALSE)","v":{"$error":"#REF!"}},"2025-05-22",{"$f":"F16+3","v":"2025-05-25"},{"$f":"F16","v":"2025-05-22"},{"$f":"G16","v":"2025-05-25"},{"$f":"I16+3","v":"2025-05-28"},null,"*","B/L表記： Port of Discharge: TAIPEI,TAIWAN, Place of Delivery: KEELUNG CFS"]
[null,"TS JOHOR",null,25013,{"$f":"VLOOKUP(B17,#REF!,2,FALSE)","v":{"$error":"#REF!"}},"2025-05-27",{"$f":"F17+3","v":"2025-05-30"},{"$f":"F17+1","v":"2025-05-28"},{"$f":"G17","v":"2025-05-30"},{"$f":"I17+4","v":"2025-06-03"},null,"#","本船変更"]
[null,"※GW前後のスケジュールは、急遽変更となる場合がございますのでご注意下さい。 *本船名変更"]
[]
[]
{"$rows_left_out":20}
{"sheet":"Qingdao","index":3,"n_rows":31,"n_cols":14,"rows_kept":31,"cut":false,"hidden":false,"merged":[[14,5,14,9],[10,1,10,2],[10,6,10,8],[29,1,29,9],[30,0,30,9],[26,6,26,8],[21,0,21,9],[22,0,22,9],[28,1,28,4],[25,1,25,3],[25,6,25,8],[2,1,2,9],[4,1,4,9],[5,5,5,8],[8,1,9,2],[8,3,9,3],[8,4,9,4],[9,6,9,8],[8,6,8,8],[10,12,10,13],[11,1,11,2],[11,6,11,8],[12,1,12,2],[12,6,12,8],[12,12,12,13]]}
[]
[]
[]
[]
[]
[null,null,null,null,null,"2025-04-30",null,null,null,"更新"]
[null,"※国内消防法該当貨物は取扱不可となります。"]
[]
[null,"VESSEL",null,"VOY","CALL","CFS CUT","ETD",null,null,"ETA"]
[null,null,null,null,null,"KOBE","KOBE",null,null,"QINGDAO",null,null,null,"2245W"]
[null,"SMC COLUMBUS",null,"2519W",{"$f":"VLOOKUP(Qingdao!B11,#REF!,2,FALSE)","v":{"$error":"#REF!"}},"2025-05-09",{"$f":"F11+4","v":"2025-05-13"},null,null,{"$f":"G11+3","v":"2025-05-16"},null,null,"ACACIA LIBRA"]
[null,"A SUWA",null,"2520W",null,"2025-05-16",{"$f":"F12+4","v":"2025-05-20"},null,null,{"$f":"G12+3","v":"2025-05-23"}]
[null,"SMC COLUMBUS",null,"2521W",{"$f":"VLOOKUP(Qingdao!B13,#REF!,2,FALSE)","v":{"$error":"#REF!"}},"2025-05-23",{"$f":"F13+4","v":"2025-05-27"},null,null,{"$f":"G13+3","v":"2025-05-30"},null,null,"ACACIA LIBRA"]
[]
[null,null,null,null,null,"・国内消防法該当貨物は取扱不可となります。"]
[]
[null,null,null,null,"1519W"]
[]
[null,"【お願い】お客様のお荷物もスムーズにお取り扱いする為に、弊社指定CFS倉庫にお送り頂く"]
[null,"お荷物の送り状に「弊社ブッキング番号記載」のご協力をお願い致します。"]
{"$rows_left_out":12}
{"sheet":"HAIPHONG","index":4,"n_rows":37,"n_cols":17,"rows_kept":37,"cut":false,"hidden":false,"merged":[[1,1,1,7],[3,1,3,7],[6,1,7,2],[6,3,7,3],[6,4,7,4],[6,5,6,6],[4,5,4,7],[23,1,23,4],[26,1,26,9],[27,0,27,8],[19,0,19,8],[20,0,20,8],[12,1,12,3],[8,1,8,2],[9,1,9,2],[10,1,10,2],[11,1,11,2],[10,5,10,6],[11,5,11,6],[7,5,7,6],[23,5,23,6],[24,5,24,6],[8,5,8,6],[9,5,9,6]]}
[]
[]
[]
[]
[null,null,null,null,null,{"$f":"+Shanghai!I5","v":"2025-04-30"},null,null,"更新"]
[]
[null,"VESSEL",null,"VOY","CALL","CFS CUT",null,"ETD","ETA"]
[null,null,null,null,null,"OSAKA/KOBE",null,"KOBE","HAIPHONG"]
[null,"SMOOTH WIND",null,"003S",{"$f":"VLOOKUP(B9,#REF!,2,FALSE)","v":{"$error":"#REF!"}},"2025-05-15",null,"2025-05-17",{"$f":"H9+8","v":"2025-05-25"}]
["*","AS SUSANNA",null,"018S",{"$f":"VLOOKUP(B10,#REF!,2,FALSE)","v":{"$error":"#REF!"}},"2025-05-22",null,"2025-05-24",{"$f":"H10+8","v":"2025-06-01"}]
["*","SWAN RIVER BRIDGE",null,"111S",{"$f":"VLOOKUP(B11,#REF!,2,FALSE)","v":{"$error":"#REF!"}},"2025-05-29",null,"2025-05-31",{"$f":"H11+8","v":"2025-06-08"}]
[null,"SMOOTH WIND",null,"004S",{"$f":"VLOOKUP(B12,#REF!,2,FALSE)","v":{"$error":"#REF!"}},"2025-06-05",null,{"$f":"F12+2","v":"2025-06-07"},{"$f":"H12+8","v":"2025-06-15"}]
[null,"*本船名変更"]
[]
[]
[null,null,null,null,null,null,null,null,null,null,null,null,null,null,null,null,"搬入先倉庫 (※)"]
[null,null,null,null,null,null,null,null,null,null,null,null,null,null,null,null,"CFS CUT"]
[]
[null,null,null,null,null,null,null,null,null,null,null,null,null,null,null,null,"DAIUN (OSA)"]
["＊＊＊subject to change with or without notice＊＊＊",null,null,null,null,null,null,null,null,null,null,null,null,null,null,null,"2022/07/06 (水)"]
{"$rows_left_out":18}
{"sheet":"HOCHIMINH","index":5,"n_rows":39,"n_cols":17,"rows_kept":39,"cut":false,"hidden":false,"merged":[[12,1,12,2],[28,1,28,9],[29,0,29,8],[24,1,24,4],[1,1,1,7],[3,1,3,7],[4,6,4,7],[6,1,7,2],[6,3,7,3],[6,4,7,4],[20,0,20,8],[21,0,21,8],[8,1,8,2],[9,1,9,2],[10,1,10,2],[11,1,11,2]]}
[]
[]
[]
[]
[null,null,null,null,null,null,{"$f":"+Shanghai!I5","v":"2025-04-30"},null,"更新"]
[]
[null,"VESSEL",null,"VOY","CALL","CFS CUT","CFS CUT","ETD","ETA"]
[null,null,null,null,null,"OSAKA","KOBE","KOBE","HONGKONG"]
[null,"NYK PAULA",null,"1018S",null,"2025-05-01",{"$f":"F9+1","v":"2025-05-02"},{"$f":"F9+7","v":"2025-05-08"},{"$f":"H9+13","v":"2025-05-21"}]
[null,"ARICA BRIDGE",null,"258S",{"$f":"VLOOKUP(B10,#REF!,2,FALSE)","v":{"$error":"#REF!"}},"2025-05-12","2025-05-13",{"$f":"F10+3","v":"2025-05-15"},{"$f":"H10+13","v":"2025-05-28"}]
[null,"CALLAO BRIDGE",null,"271S",null,"2025-05-19","2025-05-20",{"$f":"G11+2","v":"2025-05-22"},{"$f":"H11+13","v":"2025-06-04"}]
[null,"NYK PAULA",null,"1019S",{"$f":"VLOOKUP(B12,#REF!,2,FALSE)","v":{"$error":"#REF!"}},"2025-05-26",{"$f":"F12+1","v":"2025-05-27"},{"$f":"F12+3","v":"2025-05-29"},{"$f":"H12+13","v":"2025-06-11"}]
[null,"ARICA BRIDGE",null,"259S",null,"2025-06-02","2025-06-03",{"$f":"G13+2","v":"2025-06-05"},{"$f":"H13+13","v":"2025-06-18"}]
[]
[]
[]
[null,null,null,null,null,null,null,null,null,null,null,null,null,null,null,null,"搬入先倉庫 (※)"]
[null,null,null,null,null,null,null,null,null,null,null,null,null,null,null,null,"CFS CUT"]
[]
[null,null,null,null,null,null,null,null,null,null,null,null,null,null,null,null,"DAIUN (OSA)"]
{"$rows_left_out":20}
{"sheet":"Hongkong","index":6,"n_rows":41,"n_cols":17,"rows_kept":41,"cut":false,"hidden":false,"merged":[[1,1,1,7],[3,1,3,7],[4,6,4,7],[6,1,7,2],[6,3,7,3],[6,4,7,4],[12,1,12,2],[13,1,13,2],[8,1,8,2],[9,1,9,2],[10,1,10,2],[11,1,11,2],[31,0,31,8],[22,0,22,8],[23,0,23,8],[26,1,26,4],[30,1,30,9]]}
[]
[]
[]
[]
[null,null,null,null,null,null,{"$f":"+Shanghai!I5","v":"2025-04-30"},null,"更新"]
[]
[null,"VESSEL",null,"VOY","CALL","CFS CUT","CFS CUT","ETD","ETA"]
[null,null,null,null,null,"OSAKA","KOBE","KOBE","HONGKONG"]
[null,"YM INCEPTION",null,"232S",{"$f":"VLOOKUP(B9,#REF!,2,FALSE)","v":{"$error":"#REF!"}},"2025-05-07",{"$f":"F9+1","v":"2025-05-08"},{"$f":"G9+3","v":"2025-05-11"},{"$f":"H9+5","v":"2025-05-16"}]
["*","WAN HAI 331",null,"011S",{"$f":"VLOOKUP(B10,#REF!,2,FALSE)","v":{"$error":"#REF!"}},"2025-05-09",{"$f":"F10+3","v":"2025-05-12"},"2025-05-15",{"$f":"H10+4","v":"2025-05-19"}]
[null,"YM IMMENSE",null,"392S",{"$f":"VLOOKUP(B11,#REF!,2,FALSE)","v":{"$error":"#REF!"}},"2025-05-14",{"$f":"F11+1","v":"2025-05-15"},{"$f":"G11+3","v":"2025-05-18"},{"$f":"H11+5","v":"2025-05-23"}]
["*","ACX PEARL",null,"274S",{"$f":"VLOOKUP(B12,#REF!,2,FALSE)","v":{"$error":"#REF!"}},"2025-05-16","2025-05-19","2025-05-22",{"$f":"H12+4","v":"2025-05-26"}]
[null,"HORAI BRIDGE",null,"211S",{"$f":"VLOOKUP(B13,#REF!,2,FALSE)","v":{"$error":"#REF!"}},"2025-05-21",{"$f":"F13+1","v":"2025-05-22"},{"$f":"G13+3","v":"2025-05-25"},{"$f":"H13+5","v":"2025-05-30"}]
["*","BRIGHT SAKURA",null,"004S",{"$f":"VLOOKUP(B14,#REF!,2,FALSE)","v":{"$error":"#REF!"}},"2025-05-23",{"$f":"F14+3","v":"2025-05-26"},{"$f":"G14+3","v":"2025-05-29"},{"$f":"H14+4","v":"2025-06-02"}]
[null,"大阪CFS CUT日は神戸の１営業日前となります。(＝ETDの３営業日前）"]
[null,"*SP188リチウムイオンバッテリー受付本船です。"]
[]
[]
[null,null,null,null,null,null,null,null,null,null,null,null,null,null,null,null,"搬入先倉庫 (※)"]
[null,null,null,null,null,null,null,null,null,null,null,null,null,null,null,null,"CFS CUT"]
{"$rows_left_out":22}
{"sheet":"PUSAN(PANSTAR)","index":7,"n_rows":41,"n_cols":8,"rows_kept":41,"cut":false,"hidden":false,"merged":[[40,0,40,7],[27,0,27,7],[28,0,28,7],[29,1,29,7],[31,1,31,4],[39,1,39,9],[10,1,10,2],[9,1,9,2],[2,1,2,7],[4,1,4,7],[5,5,5,6],[7,1,8,2],[7,3,8,3],[7,4,8,4],[16,1,16,2],[17,1,17,2],[18,1,18,2],[11,1,11,2],[12,1,12,2],[13,1,13,2],[14,1,14,2],[15,1,15,2]]}
[]
[]
[]
[]
[]
[null,null,null,null,null,{"$f":"Shanghai!I5","v":"2025-04-30"},null,"更新"]
[]
[null,"VESSEL",null,"VOY","CALL","CFS CUT","ETD","ETA"]
[null,null,null,null,null,"OSAKA","OSAKA","BUSAN"]
[null,"PANSTAR MIRACLE",null,"5055W",{"$f":"VLOOKUP(B10,#REF!,2,FALSE)","v":{"$error":"#REF!"}},"2025-05-08",{"$f":"F10+1","v":"2025-05-09"},{"$f":"G10+1","v":"2025-05-10"}]
[null,"PANSTAR MIRACLE",null,"5056W",{"$error":"#REF!"},"2025-05-09","2025-05-12",{"$f":"G11+1","v":"2025-05-13"}]
[null,"PANSTAR MIRACLE",null,"5057W",{"$error":"#REF!"},"2025-05-13",{"$f":"F12+1","v":"2025-05-14"},"2025-05-15"]
[null,"PANSTAR MIRACLE",null,"5058W",{"$error":"#REF!"},"2025-05-15",{"$f":"F13+1","v":"2025-05-16"},"2025-05-17"]
[null,"PANSTAR MIRACLE",null,"5059W",{"$error":"#REF!"},"2025-05-16",{"$f":"F14+3","v":"2025-05-19"},"2025-05-20"]
[null,"PANSTAR MIRACLE",null,"5060W",{"$f":"VLOOKUP(B15,#REF!,2,FALSE)","v":{"$error":"#REF!"}},"2025-05-20",{"$f":"F15+1","v":"2025-05-21"},"2025-05-22"]
[null,"PANSTAR MIRACLE",null,"5061W",{"$error":"#REF!"},"2025-05-22",{"$f":"F16+1","v":"2025-05-23"},{"$f":"G16+1","v":"2025-05-24"}]
[null,"PANSTAR MIRACLE",null,"5062W",{"$error":"#REF!"},"2025-05-23",{"$f":"F17+3","v":"2025-05-26"},"2025-05-27"]
[null,"PANSTAR MIRACLE",null,"5063W",{"$f":"VLOOKUP(B18,#REF!,2,FALSE)","v":{"$error":"#REF!"}},"2025-05-27",{"$f":"F18+1","v":"2025-05-28"},"2025-05-29"]
[null,"PANSTAR MIRACLE",null,"5064W",{"$error":"#REF!"},"2025-05-29",{"$f":"F19+1","v":"2025-05-30"},{"$f":"G19+1","v":"2025-05-31"}]
[]
{"$rows_left_out":22}
{"sheet":"PUSAN(信永)","index":8,"n_rows":33,"n_cols":8,"rows_kept":33,"cut":false,"hidden":false,"merged":[[10,1,10,2],[11,1,11,2],[12,1,12,2],[2,1,2,7],[4,1,4,7],[5,5,5,6],[7,1,8,2],[7,3,8,3],[7,4,8,4],[9,1,9,2],[9,5,9,7],[32,0,32,7],[21,0,21,7],[22,0,22,7],[31,1,31,9],[23,1,23,7],[25,1,25,4]]}
[]
[]
[]
[]
[]
[null,null,null,null,null,{"$f":"Shanghai!I5","v":"2025-04-30"},null,"更新"]
[]
[null,"VESSEL",null,"VOY","CALL","CFS CUT","ETD","ETA"]
[null,null,null,null,null,"OSAKA","OSAKA","BUSAN"]
[null,"SUNWIN",null,"2519W",{"$f":"VLOOKUP(B10,#REF!,2,FALSE)","v":{"$error":"#REF!"}},"NO SERVICE"]
[null,"SUNWIN",null,"2520W",{"$f":"VLOOKUP(B11,#REF!,2,FALSE)","v":{"$error":"#REF!"}},"2025-05-14",{"$f":"F11+2","v":"2025-05-16"},"2025-05-18"]
[null,"SUNWIN",null,"2521W",{"$f":"VLOOKUP(B12,#REF!,2,FALSE)","v":{"$error":"#REF!"}},"2025-05-21","2025-05-23","2025-05-25"]
[null,"SUNWIN",null,"2522W",{"$f":"VLOOKUP(B13,#REF!,2,FALSE)","v":{"$error":"#REF!"}},"2025-05-28","2025-05-30","2025-06-01"]
[]
[]
[]
[]
[]
[]
[null,"※ バンニング場所など変更することがございます。"]
{"$rows_left_out":14}
{"sheet":"Bangkok","index":9,"n_rows":33,"n_cols":18,"rows_kept":33,"cut":false,"hidden":false,"merged":[[14,17,14,18],[14,1,14,7],[9,1,9,2],[10,1,10,2],[11,1,11,2],[12,1,12,2],[13,1,13,2],[32,0,32,7],[22,0,22,7],[23,0,23,7],[30,1,30,4],[31,1,31,7],[2,1,2,7],[4,1,4,7],[5,5,5,6],[7,1,8,2],[7,3,8,3],[7,4,8,4]]}
[]
[]
[]
[]
[]
[null,null,null,null,null,{"$f":"Shanghai!I5","v":"2025-04-30"},null,"更新"]
[]
[null,"VESSEL",null,"VOY","CARRIER","CFS CUT","ETD","ETA"]
[null,null,null,null,null,"OSAKA/KOBE","OSAKA/KOBE","BANGKOK"]
[null,"YM IMPROVEMENT",null,"259S","YML","2025-05-01",{"$f":"F10+3","v":"2025-05-04"},{"$f":"G10+10","v":"2025-05-14"}]
[null,"YM INCEPTION",null,"232S","YML","2025-05-08",{"$f":"F11+3","v":"2025-05-11"},"2025-05-21"]
[null,"YM IMMENSE",null,"392S","YML","2025-05-15",{"$f":"F12+3","v":"2025-05-18"},"2025-05-28"]
[null,"HORAI BRIDGE",null,"211S","YML","2025-05-22",{"$f":"F13+3","v":"2025-05-25"},"2025-06-04"]
[null,"YM IMPROVEMENT",null,"261S","YML","2025-05-29",{"$f":"F14+3","v":"2025-06-01"},"2025-06-11"]
[null,null,null,null,null,null,null,null,null,null,null,null,null,null,null,null,"#","本船変更"]
[]
[]
[]
[]
[]
{"$rows_left_out":14}
{"sheet":"Singapore","index":10,"n_rows":37,"n_cols":14,"rows_kept":37,"cut":false,"hidden":false,"merged":[[2,1,2,8],[4,1,4,8],[5,4,5,7],[7,1,8,2],[35,1,35,8],[27,0,27,8],[9,1,9,2],[9,10,9,11],[36,0,36,8],[31,1,31,3],[28,0,28,8],[34,1,34,4],[10,1,10,2],[13,1,13,2],[16,1,16,2],[10,10,10,11],[11,1,11,2],[11,10,11,11],[12,1,12,2],[12,10,12,11],[16,10,16,11],[13,10,13,11],[14,1,14,2],[14,10,14,11],[15,1,15,2],[15,10,15,11]]}
[]
[]
[]
[]
[]
[null,null,null,null,{"$f":"Shanghai!I5","v":"2025-04-30"},null,null,null,"更新"]
[]
[null,"VESSEL",null,"VOY","CALL","CFS CUT","CFS CUT","ETD","ETA"]
[null,null,null,null,null,"OSAKA","KOBE","KOBE","SINGAPORE",null,null,null,null,"060S"]
[null,"PANAY",null,"0IZJXS1NC",{"$f":"VLOOKUP(B10,#REF!,2,FALSE)","v":{"$error":"#REF!"}},"2025-05-02","2025-05-07","2025-05-09",{"$f":"H10+7","v":"2025-05-16"},null,"NAVIOS VERANO"]
[null,"SPIL KARTINI",null,"004S",{"$f":"VLOOKUP(B11,#REF!,2,FALSE)","v":{"$error":"#REF!"}},"2025-05-09",{"$f":"F11+3","v":"2025-05-12"},{"$f":"F11+5","v":"2025-05-14"},"2025-05-21",null,"NAVIOS VERANO"]
[null,"BALTIC NORTH",null,"0IZJZS1NC",{"$f":"VLOOKUP(B12,#REF!,2,FALSE)","v":{"$error":"#REF!"}},"2025-05-13",{"$f":"F12+1","v":"2025-05-14"},{"$f":"F12+3","v":"2025-05-16"},"2025-05-23",null,"NAVIOS VERANO"]
[null,"GIALOVA",null,"031S",{"$f":"VLOOKUP(B13,#REF!,2,FALSE)","v":{"$error":"#REF!"}},"2025-05-16",{"$f":"F13+3","v":"2025-05-19"},{"$f":"F13+5","v":"2025-05-21"},"2025-05-28",null,"NAVIOS VERANO"]
[null,"ALS FLORA",null,"0IZK1S1NC",{"$f":"VLOOKUP(B14,#REF!,2,FALSE)","v":{"$error":"#REF!"}},"2025-05-20",{"$f":"F14+1","v":"2025-05-21"},{"$f":"F14+3","v":"2025-05-23"},{"$f":"H14+7","v":"2025-05-30"},null,"NAVIOS VERANO"]
["*","GIALOVA",null,"031S",{"$f":"VLOOKUP(B15,#REF!,2,FALSE)","v":{"$error":"#REF!"}},"2025-05-23",{"$f":"F15+3","v":"2025-05-26"},{"$f":"F15+5","v":"2025-05-28"},"2025-06-04",null,"NAVIOS VERANO"]
[null,"MATOYA BAY",null,"0IZK3S1NC",{"$f":"VLOOKUP(B16,#REF!,2,FALSE)","v":{"$error":"#REF!"}},"2025-05-27",{"$f":"F16+1","v":"2025-05-28"},{"$f":"F16+3","v":"2025-05-30"},{"$f":"H16+7","v":"2025-06-06"},null,"NAVIOS VERANO"]
["*","NAGOYA TOWER",null,"018S",{"$f":"VLOOKUP(B17,#REF!,2,FALSE)","v":{"$error":"#REF!"}},"2025-05-30",{"$f":"F17+3","v":"2025-06-02"},{"$f":"F17+5","v":"2025-06-04"},"2025-06-11",null,"NAVIOS VERANO"]
[null,"*本船名が変更になりました。"]
[null,"＞＞＞大阪CFS CUT日は神戸の１営業日前となります。(＝ETDの３営業日前）＜＜＜"]
[null,null,null,null,null,null,null,null,null,null,"本船スケジュールおよび現地到着ETAは諸事情・諸条件により変更となる場合がございます"]
{"$rows_left_out":18}
{"sheet":"祝日 (2)","index":11,"n_rows":169,"n_cols":4,"rows_kept":169,"cut":false,"hidden":true,"merged":[]}
["2016年\n祝日","2016-01-01",{"$f":"TEXT(WEEKDAY(B1,1),\"aaaa\")","v":"金曜日"},"元旦"]
[null,"2016-01-02",{"$f":"TEXT(WEEKDAY(B2,1),\"aaaa\")","v":"土曜日"},"年末年始"]
[null,"2016-01-03","日曜日","年末年始"]
[null,"2016-01-04","月曜日","年末年始"]
[null,"2016-01-11","月曜日","成人の日"]
[null,"2016-02-11","木曜日","建国記念日"]
[null,"2016-03-21","月曜日","春分の日振替"]
[null,"2016-04-29","金曜日","昭和の日"]
[null,"2016-05-03","火曜日","憲法記念日"]
[null,"2016-05-04","水曜日","みどりの日"]
[null,"2016-05-05","木曜日","こどもの日"]
[null,"2016-07-18","月曜日","海の日"]
[null,"2016-08-11","木曜日","山の日"]
[null,"2016-09-19","月曜日","敬老の日"]
[null,"2016-09-22","木曜日","秋分の日"]
[null,"2016-10-10","月曜日","体育の日"]
[null,"2016-11-03","木曜日","文化の日"]
[null,"2016-11-23","水曜日","勤労感謝の日"]
[null,"2016-12-23","金曜日","天皇誕生日"]
[null,"2016-12-29","木曜日","年末年始"]
{"$rows_left_out":150}
{"sheet":"CALL SIGN","index":12,"n_rows":131,"n_cols":4,"rows_kept":131,"cut":false,"hidden":true,"merged":[]}
["CARRIER","SCAC","VESSEL","CALL SIGN"]
["MOL","MOLU","ALM WODONGA","5BGY4"]
["MCC","MCPU","ALS VENUS","9V5905"]
["MCC","MCPU","ALS VESTA","9V5904"]
["KLINE","KKLU","ANDERSON BRIDGE","3FTU2"]
["MCC","MCPU","ANNETTE-S.","D6FY5"]
["NYK","NYKS","APOLLON D","A8QD6"]
["NYK","NYKS","ARTEMIS","3ERS4"]
["KLINE","KKLU","BALTIMORE BRIDGE","3ETY2"]
["ONE","ONYE","BANGKOK BRIDGE","3FTZ8"]
["MAERSK","MAEU","BEETHOVEN","D5CE3"]
["NAMSUNG","NSSL","BOHAI STAR","DSFL4"]
["APL","APLU","BOMAR RENAISSANCE","A8JU3"]
["APL","APLU","BOTANY BAY","A8JM5"]
["CMA","11DX","BOX EXPRESS","D5GM6"]
["KLINE","KKLU","BUDAPEST BRIDGE","VRIZ5"]
["CMA",null,"CAPE FELTON","V7OX5"]
["CMA","11DX","CHINDWIN STAR","D5GW8"]
["SJJ","11WJ","CHUN JIN","BIMT"]
["CMA","11DX","CNC NEPTUNE","9V6193"]
{"$rows_left_out":112}
{"sheet":"祝日","index":13,"n_rows":117,"n_cols":4,"rows_kept":117,"cut":false,"hidden":true,"merged":[]}
["2016年\n祝日","2016-01-01",{"$f":"TEXT(WEEKDAY(B1,1),\"aaaa\")","v":"金曜日"},"元旦"]
[null,"2016-01-02",{"$f":"TEXT(WEEKDAY(B2,1),\"aaaa\")","v":"土曜日"},"年末年始"]
[null,"2016-01-03","日曜日","年末年始"]
[null,"2016-01-04","月曜日","年末年始"]
[null,"2016-01-11","月曜日","成人の日"]
[null,"2016-02-11","木曜日","建国記念日"]
[null,"2016-03-21","月曜日","春分の日振替"]
[null,"2016-04-29","金曜日","昭和の日"]
[null,"2016-05-03","火曜日","憲法記念日"]
[null,"2016-05-04","水曜日","みどりの日"]
[null,"2016-05-05","木曜日","こどもの日"]
[null,"2016-07-18","月曜日","海の日"]
[null,"2016-08-11","木曜日","山の日"]
[null,"2016-09-19","月曜日","敬老の日"]
[null,"2016-09-22","木曜日","秋分の日"]
[null,"2016-10-10","月曜日","体育の日"]
[null,"2016-11-03","木曜日","文化の日"]
[null,"2016-11-23","水曜日","勤労感謝の日"]
[null,"2016-12-23","金曜日","天皇誕生日"]
[null,"2016-12-29","木曜日","年末年始"]
{"$rows_left_out":98}
{"sheet":"Sheet1","index":14,"n_rows":0,"n_cols":0,"rows_kept":0,"cut":false,"hidden":true,"merged":[]}

{"sheet":"Sheet2","index":15,"n_rows":0,"n_cols":0,"rows_kept":0,"cut":false,"hidden":true,"merged":[]}